{"text_format":"1","workbook":"xlsx","n_sheets":14,"sheets":["USER GUIDE","1. ASSESSMENT PROFILE","2. SUMMARY AND ANALYSIS","3. TABLE SUMMARIES","4. DATA QUALITY ANALYSIS","5a. PRESUMPTIVE REGISTER - AGG","5b. PRESUMPTIVE REGISTER -  PL","6a. LAB REGISTER - AGG","6b. LAB REGISTER - PL","7a. TB TX REGISTER - AGG","7b. TB TX REGISTER - PL","8a. TPT REGISTER - AGG","8b. TPT REGISTER - PL","Hidden Formula"],"not_rendered":{"charts":12,"images":2,"macros":1,"external_links":1,"defined_names":2,"comments":0,"pivot_tables":0},"unopened":[],"bounds":{"document_bytes":16777216,"sheet_cells":100000,"rows_first":2000,"rows_last":500,"rows_between":2000,"halvings":0,"cell_chars":16384,"cell_head_chars":4096},"cells_cut":0,"cells_raw":0,"read":"whole","date_system":"1900"}

{"sheet":"USER GUIDE","index":0,"n_rows":33,"n_cols":5,"rows_kept":33,"cut":false,"hidden":false,"merged":[[15,3,15,15],[31,1,31,3],[8,1,8,15],[5,1,5,15],[14,3,14,15],[17,3,17,15],[16,3,16,15],[18,3,21,15],[22,3,25,15],[27,4,29,15]]}
[]
[]
[null,null,"Diagnostic Cascade Evaluation (DiCE) Toolkit: User Guide"]
[]
[null,"INTRODUCTION"]
[null,"The purpose of this toolkit is to identify points in the TB diagnostic cascade where failures in clinic-lab interface may prevent the initiation of TB treatment in individuals with active TB disease. The diagnostic cascade refers to a step-wise process that spans the initial presentation of an individual with presumptive TB to the ultimate initiation of TB treatment, and encompasses all intermediate steps. This toolkit is designed as a first step in procedural improvement and should be followed with planned conversation and development of action plans with implementing partners. The intended targets for these activities are sites supported by the President's Emergency Plan for AIDS Relief (PEPFAR)."]
[]
[null,"USING THE TOOL"]
{"$rows_left_out":26}
{"sheet":"1. ASSESSMENT PROFILE","index":1,"n_rows":34,"n_cols":6,"rows_kept":34,"cut":false,"hidden":false,"merged":[[33,1,33,2],[33,3,33,9],[15,2,15,4],[14,2,14,4],[15,5,15,7],[20,1,20,5],[19,3,19,8],[19,1,19,2],[17,5,17,6],[17,7,17,8],[17,1,17,2],[17,3,17,4],[18,5,18,6],[18,7,18,8],[18,1,18,2],[18,3,18,4],[29,1,29,2],[30,1,30,2],[31,1,31,2],[29,3,29,9],[30,3,30,9],[31,3,31,9],[27,1,27,2],[26,5,26,6],[23,1,23,2],[25,1,25,2],[25,3,25,4],[25,5,25,6],[27,3,27,9],[14,5,14,7],[21,1,21,2],[21,3,21,4],[26,3,26,4],[22,3,22,4],[22,7,22,9],[23,3,23,9],[25,7,25,9],[26,7,26,9],[22,1,22,2],[26,1,26,2],[21,5,21,6],[21,7,21,8],[22,5,22,6]]}
[]
[]
[]
[]
[]
[]
[]
[]
{"$rows_left_out":27}
{"sheet":"2. SUMMARY AND ANALYSIS","index":2,"n_rows":160,"n_cols":19,"rows_kept":160,"cut":false,"hidden":false,"merged":[[150,8,150,9],[151,8,151,9],[145,8,145,9],[146,8,146,9],[147,8,147,9],[148,8,148,9],[149,8,149,9],[82,7,82,9],[83,7,83,9],[76,7,76,9],[77,7,77,9],[78,7,78,9],[79,7,79,9],[80,7,80,9],[81,7,81,9],[108,7,108,10],[109,7,109,10],[101,7,101,10],[102,7,102,10],[103,7,103,10],[104,7,104,10],[105,7,105,10],[106,7,106,10],[107,7,107,10]]}
[null,"AGGREGATE-LEVEL ANALYSIS"]
[]
[null,"Steps","Period 1","Period 2","Period 3","Total"]
[null,"1. Presumptive TB",{"$f":"AggPresumptiveP1[[#Totals],[Total Presumptive TB]]","v":0},{"$f":"AggPresumptiveP2[[#Totals],[Total Presumptive TB]]","v":0},{"$f":"AggPresumptiveP3[[#Totals],[Total Presumptive TB]]","v":0},{"$f":"SUM(C4:E4)","v":0}]
[null,"2. Specimen collected",{"$f":"AggPresumptiveP1[[#Totals],[Number Specimens Collected]]","v":0},{"$f":"AggPresumptiveP2[[#Totals],[Number Specimens Collected]]","v":0},{"$f":"AggPresumptiveP3[[#Totals],[Number Specimens Collected]]","v":0},{"$f":"SUM(C5:E5)","v":0}]
[null,"3. Specimen received by lab",{"$f":"AggLabP1[[#Totals],[Total Specimens]]","v":0},{"$f":"AggLabP2[[#Totals],[Total Specimens]]","v":0},{"$f":"AggLabP3[[#Totals],[Total Specimens]]","v":0},0]
[null,"4. Specimen tested (AFB/NAAT)",{"$f":"SUM(AggLabP1[[#Totals],[AFB (-)]:[Inavlid\nNo Result Error\n(I)]])","v":0},{"$f":"SUM(AggLabP2[[#Totals],[AFB (-)]:[Inavlid\nNo Result Error\n(I)]])","v":0},{"$f":"SUM(AggLabP3[[#Totals],[AFB (-)]:[Inavlid\nNo Result Error\n(I)]])","v":0},0]
[null,"5. NAAT result in lab",{"$f":"SUM(AggLabP1[[#Totals],[MTB Not Detected\n(N)]:[Inavlid\nNo Result Error\n(I)]])","v":0},{"$f":"SUM(AggLabP2[[#Totals],[MTB Not Detected\n(N)]:[Inavlid\nNo Result Error\n(I)]])","v":0},{"$f":"SUM(AggLabP3[[#Totals],[MTB Not Detected\n(N)]:[Inavlid\nNo Result Error\n(I)]])","v":0},0]
{"$rows_left_out":153}
{"sheet":"3. TABLE SUMMARIES","index":3,"n_rows":42,"n_cols":27,"rows_kept":42,"cut":false,"hidden":false,"merged":[[3,15,3,16],[3,1,3,2],[30,1,30,6],[2,8,2,13],[3,8,3,9],[29,8,29,13],[0,15,0,20],[0,8,0,13],[0,22,0,27],[2,22,2,26],[0,1,0,6],[2,1,2,6],[2,15,2,20]]}
[null,"PRESUMPTIVE TB REGISTER: AGGREGATE-LEVEL DATA",null,null,null,null,null,null,"LAB REGISTER: AGGREGATE-LEVEL DATA",null,null,null,null,null,null,"TB TREATMENT REGISTER: AGGREGATE-LEVEL DATA",null,null,null,null,null,null,"TPT REGISTER: AGGREGATE-LEVEL DATA"]
[]
[null,"TB CLINIC PRESUMPTIVE TB REGISTER: AGGREGATE-LEVEL",null,null,null,null,null,null,"LAB REGISTER: AGGREGATE-LEVEL\n-Diagnosis testing only, excluding referral site samples-",null,null,null,null,null,null,"TB TREATMENT REGISTER: AGGREGATE-LEVEL",null,null,null,null,null,null,"TB TREATMENT REGISTER: AGGREGATE-LEVEL"]
[null,"CATEGORY",null,"Period 1","Period 2","Period 3","TOTAL",null,"CATEGORY",null,"Period 1","Period 2","Period 3","TOTAL",null,"CATEGORY",null,"Period 1","Period 2","Period 3","TOTAL",null,"TPT Descriptive Details","Period 1","Period 2","Period 3","Total"]
[null,"Total Presumptive TB",null,{"$f":"AggPresumptiveP1[[#Totals],[Total Presumptive TB]]","v":0},{"$f":"AggPresumptiveP2[[#Totals],[Total Presumptive TB]]","v":0},{"$f":"AggPresumptiveP3[[#Totals],[Total Presumptive TB]]","v":0},{"$f":"SUM(D5:F5)","v":0},null,"Total Specimens",null,{"$f":"AggLabP1[[#Totals],[Total Specimens]]","v":0},{"$f":"AggLabP2[[#Totals],[Total Specimens]]","v":0},{"$f":"AggLabP3[[#Totals],[Total Specimens]]","v":0},{"$f":"SUM(K5:M5)","v":0},null,"Total Patients",null,{"$f":"AggTreatmentP1[[#Totals],[Total Patients ]]","v":0},{"$f":"AggTreatmentP2[[#Totals],[Total Patients ]]","v":0},{"$f":"AggTreatmentP3[[#Totals],[Total Patients ]]","v":0},{"$f":"SUM(R5:T5)","v":0},null,"TPT Started",{"$f":"AggTPTP1[[#Totals],[Total Patients ]]","v":0},{"$f":"AggTPTP2[[#Totals],[Total Patients ]]","v":0},{"$f":"AggTPTP3[[#Totals],[Total Patients ]]","v":0},{"$f":"SUM(X5:Z5)","v":0}]
[null,"Age",null,null,null,null,null,null,"Sex",null,null,null,null,null,null,"Sex",null,null,null,null,null,null,"   Females",{"$f":"AggTPTP1[[#Totals],[Female]]","v":0},0,0,{"$f":"SUM(X6:Z6)","v":0}]
[null,null,"Age (0 - 14)",{"$f":"AggPresumptiveP1[[#Totals],[Age 0-14]]","v":0},{"$f":"AggPresumptiveP2[[#Totals],[Age 0-14]]","v":0},{"$f":"AggPresumptiveP3[[#Totals],[Age 0-14]]","v":0},{"$f":"SUM(D7:F7)","v":0},null,null,"Female",{"$f":"AggLabP1[[#Totals],[Female]]","v":0},{"$f":"AggLabP2[[#Totals],[Female]]","v":0},{"$f":"AggLabP3[[#Totals],[Female]]","v":0},{"$f":"SUM(K7:M7)","v":0},null,null,"Female",{"$f":"AggTreatmentP1[[#Totals],[Female]]","v":0},{"$f":"AggTreatmentP2[[#Totals],[Female]]","v":0},{"$f":"AggTreatmentP3[[#Totals],[Female]]","v":0},{"$f":"SUM(R7:T7)","v":0},null,"   Males",{"$f":"AggTPTP1[[#Totals],[Male]]","v":0},0,0,{"$f":"SUM(X7:Z7)","v":0}]
[null,null,"Age (15+)",{"$f":"AggPresumptiveP1[[#Totals],[Age 15+ ]]","v":0},{"$f":"AggPresumptiveP2[[#Totals],[Age 15+ ]]","v":0},{"$f":"AggPresumptiveP3[[#Totals],[Age 15+ ]]","v":0},{"$f":"SUM(D8:F8)","v":0},null,null,"Male",{"$f":"AggLabP1[[#Totals],[Male]]","v":0},{"$f":"AggLabP2[[#Totals],[Male]]","v":0},{"$f":"AggLabP3[[#Totals],[Male]]","v":0},{"$f":"SUM(K8:M8)","v":0},null,null,"Male",{"$f":"AggTreatmentP1[[#Totals],[Male]]","v":0},{"$f":"AggTreatmentP2[[#Totals],[Male]]","v":0},{"$f":"AggTreatmentP3[[#Totals],[Male]]","v":0},{"$f":"SUM(R8:T8)","v":0},null,"   0-14",{"$f":"AggTPTP1[[#Totals],[Age 0-14]]","v":0},0,0,{"$f":"SUM(X8:Z8)","v":0}]
{"$rows_left_out":35}
{"sheet":"4. DATA QUALITY ANALYSIS","index":4,"n_rows":29,"n_cols":37,"rows_kept":29,"cut":false,"hidden":false,"merged":[[4,8,4,10],[4,11,4,13],[4,14,4,16],[4,17,4,19],[11,4,11,5],[3,2,3,5],[4,2,4,5],[6,1,6,5],[2,2,2,5],[2,1,4,1],[30,2,30,5],[20,4,20,5],[21,4,21,5],[22,4,22,5],[23,4,23,5],[27,3,27,5],[28,3,28,5],[25,3,25,5],[26,3,26,5],[2,21,2,24],[2,25,2,28],[2,29,2,32],[2,33,2,36],[29,2,29,5],[15,4,15,5],[16,4,16,5],[18,4,18,5],[19,1,19,3],[7,1,7,5],[14,1,14,3],[12,4,12,5],[13,4,13,5],[17,4,17,5],[9,1,9,3],[10,4,10,5]]}
[null,"DATA AGREEMENT ANALYSIS (PATIENT-LEVEL)"]
[]
[null,"Color Legend: ","Presumptive TB Register",null,null,null,null,"Patient-level data is auto-populated from data entry cells on PL data entry tabs. Blank cells indicate no data collected during abstraction. ",null,null,null,null,null,null,null,null,null,null,null,null,null,"Sex: Agreement between sources",null,null,null,"Age: Agreement between sources",null,null,null,"NAAT Result: Agreement between sources",null,null,null,"HIV Status: Agreement between sources"]
[null,null,"Lab Register"]
[null,null,"TB Treatment Register",null,null,null,null,null,"Sex ",null,null,"Age",null,null,"NAAT Result",null,null,"HIV Status"]
[null,null,null,null,null,null,null,"Column1","Column2","Column3","Column4","Column5","Column6","Column7","Column8","Column9","Column10","Column11","Column12","Column13"]
[null,"AGREEMENT SUMMARY",null,null,null,null,null,"P1",{"$f":"'5b. PRESUMPTIVE REGISTER -  PL'!D14","v":0},{"$f":"'6b. LAB REGISTER - PL'!D11","v":0},{"$f":"'7b. TB TX REGISTER - PL'!F9","v":0},{"$f":"'5b. PRESUMPTIVE REGISTER -  PL'!E14","v":0},{"$f":"'6b. LAB REGISTER - PL'!E11","v":0},{"$f":"'7b. TB TX REGISTER - PL'!G9","v":0},{"$f":"'5b. PRESUMPTIVE REGISTER -  PL'!M14","v":0},{"$f":"'6b. LAB REGISTER - PL'!N11","v":0},{"$f":"'7b. TB TX REGISTER - PL'!L9","v":0},{"$f":"IF(OR('5b. PRESUMPTIVE REGISTER -  PL'!O14=\"Positive\",'5b. PRESUMPTIVE REGISTER -  PL'!P14=\"Positive\"),\"Positive\",IF(OR('5b. PRESUMPTIVE REGISTER -  PL'!O14=\"Negative\",'5b. PRESUMPTIVE REGISTER -  PL'!P14=\"Negative\"),\"Negative\",IF(AND('5b. PRESUMPTIVE REGISTER -  PL'!O14=\"Blank\",'5b. PRESUMPTIVE REGISTER -  PL'!P14=\"Blank\"),\"Blank\",\"0\")))","v":"0"},{"$f":"IF(OR('6b. LAB REGISTER - PL'!F11=\"Positive\",'6b. LAB REGISTER - PL'!G11=\"Positive\"),\"Positive\",IF(OR('6b. LAB REGISTER - PL'!F11=\"Negative\",'6b. LAB REGISTER - PL'!G11=\"Negative\"),\"Negative\",IF(AND('6b. LAB REGISTER - PL'!F11=\"Blank\", '6b. LAB REGISTER - PL'!G11=\"Blank\"),\"Blank\",\"0\")))","v":"0"},{"$f":"'7b. TB TX REGISTER - PL'!R9","v":0},"P1",{"$f":"IF(AND(I7<>0,J7<>0,I7=J7),\"Yes\",\"No\")","v":"No"},{"$f":"IF(AND(I7<>0,K7<>0,I7=K7),\"Yes\",\"No\")","v":"No"},{"$f":"IF(AND(J7<>0,K7<>0,J7=K7),\"Yes\",\"No\")","v":"No"},{"$f":"IF(AND(I7<>0,J7<>0,K7<>0,I7=J7,I7=K7,J7=K7),\"Yes\",\"No\")","v":"No"},{"$f":"IF(AND(L7<>0,M7<>0,L7=M7),\"Yes\",\"No\")","v":"No"},{"$f":"IF(AND(L7<>0,N7<>0,L7=N7),\"Yes\",\"No\")","v":"No"},{"$f":"IF(AND(M7<>0,N7<>0,M7=N7),\"Yes\",\"No\")","v":"No"},{"$f":"IF(AND(L7<>0,M7<>0,N7<>0,L7=M7,M7=N7,L7=N7),\"Yes\",\"No\")","v":"No"},{"$f":"IF(AND(O7<>0,P7<>0,O7=P7),\"Yes\",\"No\")","v":"No"},{"$f":"IF(AND(O7<>0,Q7<>0,O7=Q7),\"Yes\",\"No\")","v":"No"},{"$f":"IF(AND(P7<>0,Q7<>0,P7=Q7),\"Yes\",\"No\")","v":"No"},{"$f":"IF(AND(O7<>0,P7<>0,Q7<>0,O7=P7,O7=Q7,P7=Q7),\"Yes\",\"No\")","v":"No"},{"$f":"IF(AND(R7<>\"0\",S7<>\"0\",R7=S7),\"Yes\",\"No\")","v":"No"},{"$f":"IF(AND(R7<>\"0\",T7<>0,R7=T7),\"Yes\",\"No\")","v":"No"},{"$f":"IF(AND(S7<>\"0\",T7<>0,S7=T7),\"Yes\",\"No\")","v":"No"},{"$f":"IF(AND(R7<>0,S7<>0,T7<>0,R7=S7,S7=T7,R7=T7),\"Yes\",\"No\")","v":"No"}]
[null,"(Calculated only for patients found in respective registers)",null,null,null,null,null,"P2",{"$f":"'5b. PRESUMPTIVE REGISTER -  PL'!D15","v":0},{"$f":"'6b. LAB REGISTER - PL'!D12","v":0},{"$f":"'7b. TB TX REGISTER - PL'!F10","v":0},{"$f":"'5b. PRESUMPTIVE REGISTER -  PL'!E15","v":0},{"$f":"'6b. LAB REGISTER - PL'!E12","v":0},{"$f":"'7b. TB TX REGISTER - PL'!G10","v":0},{"$f":"'5b. PRESUMPTIVE REGISTER -  PL'!M15","v":0},{"$f":"'6b. LAB REGISTER - PL'!N12","v":0},{"$f":"'7b. TB TX REGISTER - PL'!L10","v":0},{"$f":"IF(OR('5b. PRESUMPTIVE REGISTER -  PL'!O15=\"Positive\",'5b. PRESUMPTIVE REGISTER -  PL'!P15=\"Positive\"),\"Positive\",IF(OR('5b. PRESUMPTIVE REGISTER -  PL'!O15=\"Negative\",'5b. PRESUMPTIVE REGISTER -  PL'!P15=\"Negative\"),\"Negative\",IF(AND('5b. PRESUMPTIVE REGISTER -  PL'!O15=\"Blank\",'5b. PRESUMPTIVE REGISTER -  PL'!P15=\"Blank\"),\"Blank\",\"0\")))","v":"0"},{"$f":"IF(OR('6b. LAB REGISTER - PL'!F12=\"Positive\",'6b. LAB REGISTER - PL'!G12=\"Positive\"),\"Positive\",IF(OR('6b. LAB REGISTER - PL'!F12=\"Negative\",'6b. LAB REGISTER - PL'!G12=\"Negative\"),\"Negative\",IF(AND('6b. LAB REGISTER - PL'!F12=\"Blank\", '6b. LAB REGISTER - PL'!G12=\"Blank\"),\"Blank\",\"0\")))","v":"0"},{"$f":"'7b. TB TX REGISTER - PL'!R10","v":"Negative"},"P2","No","No","No","No","No","No","No","No","No","No","No","No","No","No","No","No"]
{"$rows_left_out":22}
{"sheet":"5a. PRESUMPTIVE REGISTER - AGG","index":5,"n_rows":103,"n_cols":22,"rows_kept":103,"cut":false,"hidden":false,"merged":[[2,1,2,15],[3,1,3,15],[4,1,4,15],[5,1,5,15],[6,1,6,15],[10,0,36,0],[10,11,10,13],[10,14,10,18],[10,19,10,21],[10,8,10,9],[10,3,10,4],[10,5,10,6],[7,1,7,15],[41,3,41,4],[41,5,41,6],[42,3,42,4],[42,5,42,6],[9,11,9,21],[9,8,9,10],[9,3,9,4],[9,5,9,6],[76,0,101,0],[44,0,69,0],[73,3,73,4],[73,5,73,6],[74,3,74,4],[74,5,74,6],[73,8,73,10],[74,8,74,9],[41,8,41,10],[42,8,42,9],[41,11,41,21],[42,11,42,13],[42,14,42,18],[42,19,42,21],[74,19,74,21],[74,11,74,13],[74,14,74,18],[73,11,73,21]]}
["AGGREGATE DATA COLLECTION: PRESUMPTIVE TB REGISTER"]
[]
[null,"Instructions: "]
[null,"   1. Gather Presumptive TB Registers for designated data abstraction period. "]
[null,"   2. Count the page totals for each field and record them here. Each row on this page will represent sums from one page of a register; sections are provided for discrete time periods."]
[null,"Note: "]
[null,"  - Only collect data on entries where the purpose for testing is diagnosis; follow-up tests should not be recorded. "]
[null,"  - Only collect data on entries where the specimen originated from the TB/HIV clinics visited for this assessment. Samples referred from elsewhere should not be recorded. "]
{"$rows_left_out":96}
{"sheet":"5b. PRESUMPTIVE REGISTER -  PL","index":6,"n_rows":37,"n_cols":20,"rows_kept":37,"cut":false,"hidden":false,"merged":[[36,1,36,6],[11,14,11,18],[11,6,11,13],[0,1,0,6],[35,1,35,6],[10,1,10,18],[4,1,6,5],[2,1,2,5],[3,1,3,5]]}
[null,"PRESUMPTIVE TB REGISTER: PATIENT-LEVEL DATA"]
[]
[null,"Instructions: \n"]
[null,"1. Gather Presumptive TB Registers for data abstraction period. "]
[null,"Sampling: \nSample size will be determined by calculating 5% of total presumptives found in the Presumptive TB Register, with a minimum of 6 and a maximum of 20. Select half HIV+ individuals and half HIV- individuals randomly, irrespective of data quality or completion. "]
[]
[]
[]
{"$rows_left_out":30}
{"sheet":"6a. LAB REGISTER - AGG","index":7,"n_rows":103,"n_cols":20,"rows_kept":103,"cut":false,"hidden":false,"merged":[[73,17,73,19],[74,14,74,16],[74,17,74,18],[0,0,0,19],[2,1,2,19],[3,1,3,19],[4,1,4,19],[5,1,5,19],[6,1,6,19],[9,17,9,19],[10,17,10,18],[9,7,9,16],[10,14,10,16],[41,7,41,16],[41,17,41,19],[42,14,42,16],[7,1,7,19],[42,5,42,6],[42,7,42,8],[10,3,10,4],[10,5,10,6],[10,7,10,8],[10,9,10,13],[42,9,42,13],[42,17,42,18],[41,3,41,4],[41,5,41,6],[9,3,9,4],[9,5,9,6],[74,3,74,4],[10,0,36,0],[42,0,68,0],[74,0,100,0],[42,3,42,4],[73,3,73,4],[74,5,74,6],[74,7,74,8],[74,9,74,13],[73,5,73,6],[73,7,73,16]]}
["AGGREGATE DATA COLLECTION: LAB REGISTER"]
[]
[null,"Instructions: "]
[null,"   1. Gather TB Lab Registers for designated data abstraction period. "]
[null,"   2. Count the page totals for each field and record them here. Each row on this page will represent sums from one page of a register; sections are provided for discrete time periods."]
[null,"Note: "]
[null,"  - Only collect data on entries where the purpose for testing is diagnosis; follow-up tests should not be recorded. "]
[null,"  - Only collect data on entries where the specimen originated from the TB/HIV clinics visited for this assessment. Samples referred from elsewhere should not be recorded. "]
{"$rows_left_out":96}
{"sheet":"6b. LAB REGISTER - PL","index":8,"n_rows":32,"n_cols":18,"rows_kept":32,"cut":false,"hidden":false,"merged":[[7,1,7,17],[31,1,31,6],[32,1,32,6],[8,5,8,6],[8,7,8,10],[8,12,8,15],[0,1,0,22],[2,1,2,6],[3,1,3,6],[4,1,4,6],[5,1,5,6]]}
[null,"LAB REGISTER: PATIENT-LEVEL DATA"]
[]
[null,"Instructions: \n"]
[null,"1. Gather lab registers for designated data abstraction period. "]
[null,"2. Only collect data on entries where the purpose for testing is diagnosis; follow-up tests should not be recorded. "]
[null,"3. Only collect data on entries where the specimen originated from the TB/HIV clinics of interest. Samples referred form elsewhere should not be recorded. "]
[]
[null,"LAB REGISTER: PATIENT-LEVEL (ONLY DIAGNOSTIC TESTING)"]
{"$rows_left_out":25}
{"sheet":"7a. TB TX REGISTER - AGG","index":9,"n_rows":103,"n_cols":35,"rows_kept":103,"cut":false,"hidden":false,"merged":[[6,3,6,4],[6,5,6,6],[8,16,8,20],[7,5,8,6],[7,3,8,4],[7,12,8,12],[7,26,8,26],[73,0,101,0],[40,0,68,0],[8,13,8,15],[7,13,7,20],[8,21,8,24],[7,21,7,25],[40,3,41,4],[73,3,74,4],[73,5,74,6],[40,5,41,6],[40,7,41,11],[40,12,41,12],[72,13,72,20],[72,21,72,25],[40,21,40,25],[40,33,41,33],[40,34,41,34],[7,27,8,32],[6,27,6,32],[39,7,39,11],[39,13,39,20],[39,21,39,25],[39,27,39,32],[7,7,8,11],[6,7,6,11],[6,13,6,20],[40,13,40,20],[41,13,41,15],[6,21,6,25],[7,33,8,33],[7,34,8,34],[40,26,41,26],[40,27,41,32],[39,3,39,4],[39,5,39,6],[72,3,72,4],[72,5,72,6],[72,7,72,11],[6,0,35,0],[40,1,41,2],[73,33,74,33],[73,34,74,34],[74,13,74,15],[74,16,74,20],[74,21,74,24],[72,27,72,32],[73,7,74,11],[73,12,74,12],[73,13,73,20],[73,21,73,25],[73,26,74,26],[73,27,74,32],[41,16,41,20],[41,21,41,24]]}
["TB TREATMENT REGISTER JOB AID"]
[]
[null,"Instructions: "]
[null,"   1. Gather TB Treatment registers for designated data abstraction period. "]
[null,"   2. Count the page totals for each field and record them here. Each row on this page will represent sums from one page of a register; sections are provided for discrete time periods."]
[]
["Time Period One          ***          Time Period One          ***          Time Period One          ***          Time Period One          ***          Time Period One     ***     Time Period One          ***          Time Period One          ***          Time Period One          ***          Time Period One          ***          Time Period One",null,null,"5",null,6,null,11,null,null,null,null,14,16,null,null,null,null,null,null,null,"18",null,null,null,null,"21","22",null,null,null,null,null,23,24]
[null,null,null,"Sex",null,"Age",null,"Type of TB Patient",null,null,null,null,null,"Pre - Rx",null,null,null,null,null,null,null,"TB/HIV Activities",null,null,null,null,null,"Treatment Outcome"]
{"$rows_left_out":96}
{"sheet":"7b. TB TX REGISTER - PL","index":10,"n_rows":30,"n_cols":21,"rows_kept":30,"cut":false,"hidden":false,"merged":[[30,1,30,6],[0,1,0,6],[2,1,2,7],[3,1,3,7],[5,1,5,20],[6,17,6,20],[29,1,29,6]]}
[null,"TB TREATMENT REGISTER: PATIENT-LEVEL DATA"]
[]
[null,"Instructions: \n"]
[null,"1. Gather TB Treatment registers for designated data abstraction period and abstract for patients in selected sample."]
[]
[null,"TB TREATMENT REGISTER: PATIENT-LEVEL"]
[null,null,null,null,null,null,null,null,null,null,null,null,null,null,null,null,null,"HIV"]
[null,"PATIENT","Available in Register?","Date of Registration*","TB Registration Number","Sex","Age \n(<15, 15+)","Date Treatment Started*","Registration Group","Month 0 Smear Result","Month 0 Date (Smear)","Xpert MTB Result","Xpert RIF Result","Chest X-Ray Suggestive? ","TB Registration No. ","Treatment Outcome","Date of Treatment Outcome*","HIV Status at Beginning of Treatment","On ART?","ART Start Date*","HIV Status at End of Treatment"]
{"$rows_left_out":23}
{"sheet":"8a. TPT REGISTER - AGG","index":11,"n_rows":97,"n_cols":23,"rows_kept":97,"cut":false,"hidden":false,"merged":[[68,18,68,22],[66,28,66,34],[68,0,94,0],[37,0,64,0],[68,3,68,4],[68,5,68,6],[68,7,68,8],[68,9,68,12],[68,13,68,17],[6,18,6,22],[6,28,6,34],[37,3,37,4],[37,5,37,6],[37,7,37,8],[37,9,37,12],[37,13,37,17],[37,18,37,22],[36,28,36,34],[6,13,6,17],[6,0,32,0],[6,3,6,4],[6,5,6,6],[6,7,6,8],[6,9,6,12]]}
["TPT REGISTER JOB AID"]
[]
[null,"Instructions: "]
[null,"   1. Gather TPT registers for designated data abstraction period. "]
[null,"   2. Count the page totals for each field and record them here. Each row on this page will represent sums from one page of a register; sections are provided for discrete time periods."]
[]
["Time Period One          ***          Time Period One          ***          Time Period One          ***          Time Period One          ***          Time Period One     ***     Time Period One          ***          Time Period One          ***          Time Period One          ***          Time Period One          ***          Time Period One",null,null,"Sex",null,"Age",null,"Type of Patient",null,"Outcome",null,null,null,"Stopped IPT",null,null,null,null,"Lost to Follow Up"]
[null,"Register Page #","Total Patients ","Female","Male","Age 0-14","Age 15+","PLHIV newly enrolled on into HIV care and treatment","PLHIV on follow-up visit for HIV care and treatment ","IPT Completed","Developed active TB","Died","Transferred out","1. Patient developed symptoms of hepatitis ","2. Patient developed neurological symptoms","3. Patient developed TB","4. Patient not adherent","5. Other (specify) ","1. Client tracked and continued on IPT","2. Client tracked, but stopped IPT","3. Client died","4. Client tracking unsuccessful","5. Other (specify)"]
{"$rows_left_out":90}
{"sheet":"8b. TPT REGISTER - PL","index":12,"n_rows":30,"n_cols":10,"rows_kept":30,"cut":false,"hidden":false,"merged":[[29,1,29,6],[5,1,5,20],[2,1,2,7],[3,1,3,7],[0,1,0,6],[28,1,28,6]]}
[null,"TB TREATMENT REGISTER: PATIENT-LEVEL DATA"]
[]
[null,"Instructions: \n"]
[null,"1. Gather TPT registers for designated data abstraction period and abstract for patients in selected sample."]
[]
[null,"TB TREATMENT REGISTER: PATIENT-LEVEL"]
[null,"PATIENT","Available in TPT Register?","Sex","Age \n(<15, 15+)","Date TPT Started*","New/Existing ART Patient","TPT Outcome ","Reason for stopping TPT","Lost to Follow-up Activities"]
[null,"P1"]
{"$rows_left_out":23}
{"sheet":"Hidden Formula","index":13,"n_rows":8,"n_cols":2,"rows_kept":8,"cut":false,"hidden":false,"merged":[]}
[]
[null,"Date validation "]
[null,{"$f":"TODAY()","v":"2022-09-20"}]
[]
[null,{"$f":"B3-1","v":"2022-09-19"}]
[]
[]
[null,"2020-09-21"]